{"text_format":"1","workbook":"xlsx","n_sheets":11,"sheets":["Menu","Clientes","Produtos","Vendas","Relatório","Instruções","BDClientes","BDProdutos","BDVendas","BDMovEstoque","Tab"],"not_rendered":{"charts":6,"images":22,"macros":1,"external_links":0,"defined_names":3,"comments":0,"pivot_tables":6},"unopened":[],"bounds":{"document_bytes":16777216,"sheet_cells":100000,"rows_first":2000,"rows_last":500,"rows_between":2000,"halvings":0,"cell_chars":16384,"cell_head_chars":4096},"cells_cut":0,"cells_raw":0,"read":"whole","date_system":"1900"}

{"sheet":"Menu","index":0,"n_rows":26,"n_cols":7,"rows_kept":26,"cut":false,"hidden":false,"merged":[[25,4,25,5],[25,6,25,14]]}
[]
[]
[]
[]
[]
[]
[]
[]
[]
[]
[]
[]
[]
[]
[]
[]
[]
[]
[]
[]
[]
[]
[]
[]
[]
[null,null,null,null,"Empresa:",null,"Empresa ABCDE"]

{"sheet":"Clientes","index":1,"n_rows":19,"n_cols":4,"rows_kept":19,"cut":false,"hidden":false,"merged":[[14,2,14,7],[16,2,16,7],[18,2,18,3],[10,1,10,10]]}
[]
[]
[]
[]
[]
[]
[]
[]
[]
[]
[null,"CADASTRO DE CLIENTES\nCadastre os clientes da sua empresa."]
[]
[null,"Código:",null,"Campo Automático. Não é necessário preencher. "]
[]
[null,"Nome:"]
[]
[null,"Endereço:"]
[]
[null,"Telefone:"]

{"sheet":"Produtos","index":2,"n_rows":25,"n_cols":12,"rows_kept":25,"cut":false,"hidden":false,"merged":[[10,1,10,10],[20,2,20,7],[24,2,24,3],[18,3,18,4],[13,11,14,13],[15,11,16,13],[18,9,20,13],[14,2,14,7],[12,11,12,13],[16,2,16,4]]}
[]
[]
[]
[]
[]
[]
[]
[]
[]
[]
[null,"CADASTRO DE PRODUTOS\nCadastre os produtos da sua empresa."]
[]
[null,"Código:",null,"Campo Automático. Não é necessário preencher. ",null,null,null,null,null,null,null,"ESTOQUE ATUAL"]
[null,null,null,null,null,null,null,null,null,null,null,{"$f":"IFERROR(VLOOKUP(C13,BDProdutos!A:F,6,0),\"\")","v":""}]
[null,"Descrição:"]
[null,null,null,null,null,null,null,null,null,null,null,{"$f":"IFERROR(L14*C17,\"\")","v":""}]
[null,"Valor:"]
[]
[null,"Estoque Mínimo:",null,null,null,null,null,null,null,{"$f":"IF(L14<D19,\"O estoque atual é menor que o estoque mínimo\",\"\")","v":""}]
[]
[null,"Fornecedor:"]
[]
[]
[]
[null,"Quantidade:"]

{"sheet":"Vendas","index":3,"n_rows":68,"n_cols":14,"rows_kept":68,"cut":false,"hidden":false,"merged":[[60,13,60,14],[61,13,61,14],[62,13,62,14],[63,13,63,14],[64,13,64,14],[65,13,65,14],[66,13,66,14],[67,13,67,14],[51,13,51,14],[52,13,52,14],[53,13,53,14],[54,13,54,14],[55,13,55,14],[56,13,56,14],[57,13,57,14],[58,13,58,14],[59,13,59,14],[42,13,42,14],[43,13,43,14],[44,13,44,14],[45,13,45,14],[46,13,46,14],[47,13,47,14],[48,13,48,14],[49,13,49,14],[50,13,50,14],[33,13,33,14],[34,13,34,14],[35,13,35,14],[36,13,36,14],[37,13,37,14],[38,13,38,14],[39,13,39,14],[40,13,40,14],[41,13,41,14],[24,13,24,14],[25,13,25,14],[26,13,26,14],[27,13,27,14],[28,13,28,14],[29,13,29,14],[30,13,30,14],[31,13,31,14],[32,13,32,14],[10,1,10,10],[16,13,16,14],[17,13,17,14],[18,13,18,14],[19,13,19,14],[20,13,20,14],[21,13,21,14],[22,13,22,14],[23,13,23,14],[67,11,67,12],[64,11,64,12],[65,11,65,12],[66,11,66,12],[18,1,18,4],[59,1,59,4],[60,1,60,4],[63,1,63,4],[64,1,64,4],[61,1,61,4],[62,1,62,4],[64,5,64,9],[65,5,65,9],[66,5,66,9],[65,1,65,4],[66,1,66,4],[63,11,63,12],[18,5,18,9],[59,5,59,9],[60,5,60,9],[61,5,61,9],[62,5,62,9],[63,5,63,9],[18,11,18,12],[59,11,59,12],[60,11,60,12],[61,11,61,12],[14,2,14,5],[16,5,16,9],[16,11,16,12],[17,5,17,9],[12,3,12,7],[17,11,17,12],[16,1,16,4],[17,1,17,4],[24,11,24,12],[29,1,29,4],[29,5,29,9],[29,11,29,12],[30,1,30,4],[30,5,30,9],[30,11,30,12],[27,1,27,4],[27,5,27,9],[27,11,27,12],[28,1,28,4],[28,5,28,9],[28,11,28,12],[62,11,62,12],[21,1,21,4],[21,5,21,9],[21,11,21,12],[22,1,22,4],[22,5,22,9],[22,11,22,12],[19,1,19,4],[19,5,19,9],[19,11,19,12],[20,1,20,4],[20,5,20,9],[20,11,20,12],[25,1,25,4],[25,5,25,9],[25,11,25,12],[26,1,26,4],[26,5,26,9],[26,11,26,12],[23,1,23,4],[23,5,23,9],[23,11,23,12],[24,1,24,4],[24,5,24,9],[33,1,33,4],[33,5,33,9],[33,11,33,12],[34,1,34,4],[34,5,34,9],[34,11,34,12],[31,1,31,4],[31,5,31,9],[31,11,31,12],[32,1,32,4],[32,5,32,9],[32,11,32,12],[37,1,37,4],[37,5,37,9],[37,11,37,12],[38,1,38,4],[38,5,38,9],[38,11,38,12],[35,1,35,4],[35,5,35,9],[35,11,35,12],[36,1,36,4],[36,5,36,9],[36,11,36,12],[41,1,41,4],[41,5,41,9],[41,11,41,12],[42,1,42,4],[42,5,42,9],[42,11,42,12],[39,1,39,4],[39,5,39,9],[39,11,39,12],[40,1,40,4],[40,5,40,9],[40,11,40,12],[45,1,45,4],[45,5,45,9],[45,11,45,12],[46,1,46,4],[46,5,46,9],[46,11,46,12],[43,1,43,4],[43,5,43,9],[43,11,43,12],[44,1,44,4],[44,5,44,9],[44,11,44,12],[49,1,49,4],[49,5,49,9],[49,11,49,12],[50,1,50,4],[50,5,50,9],[50,11,50,12],[47,1,47,4],[47,5,47,9],[47,11,47,12],[48,1,48,4],[48,5,48,9],[48,11,48,12],[53,1,53,4],[53,5,53,9],[53,11,53,12],[54,1,54,4],[54,5,54,9],[54,11,54,12],[51,1,51,4],[51,5,51,9],[51,11,51,12],[52,1,52,4],[52,5,52,9],[52,11,52,12],[57,1,57,4],[57,5,57,9],[57,11,57,12],[58,1,58,4],[58,5,58,9],[58,11,58,12],[55,1,55,4],[55,5,55,9],[55,11,55,12],[56,1,56,4],[56,5,56,9],[56,11,56,12]]}
[]
[]
[]
[]
[]
[]
[]
[]
[]
[]
[null,"CADASTRO DE VENDAS\nCadastre as saídas dos produtos."]
[]
[null,"Cliente:",null,{"$f":"IFERROR(VLOOKUP(C13,BDClientes!A:B,2,0),\"\")","v":""}]
[]
[null,"Produto:"]
[]
[null,"Código Produto",null,null,null,"Descrição do Produto",null,null,null,null,"Qtde","Valor Unitário",null,"Subtotal"]
[null,null,null,null,null,{"$f":"IFERROR(INDEX(BDProdutos!A:H,MATCH(Vendas!B18,BDProdutos!A:A,0),2),\"\")","v":""},null,null,null,null,null,{"$f":"IFERROR(INDEX(BDProdutos!A:H,MATCH(Vendas!B18,BDProdutos!A:A,0),3),\"\")","v":""},null,{"$f":"IFERROR(K18*L18,\"\")","v":""}]
[null,null,null,null,null,{"$f":"IFERROR(INDEX(BDProdutos!A:H,MATCH(Vendas!B19,BDProdutos!A:A,0),2),\"\")","v":""},null,null,null,null,null,{"$f":"IFERROR(INDEX(BDProdutos!A:H,MATCH(Vendas!B19,BDProdutos!A:A,0),3),\"\")","v":""},null,{"$f":"IFERROR(K19*L19,\"\")","v":""}]
[null,null,null,null,null,{"$f":"IFERROR(INDEX(BDProdutos!A:H,MATCH(Vendas!B20,BDProdutos!A:A,0),2),\"\")","v":""},null,null,null,null,null,{"$f":"IFERROR(INDEX(BDProdutos!A:H,MATCH(Vendas!B20,BDProdutos!A:A,0),3),\"\")","v":""},null,""]
[null,null,null,null,null,{"$f":"IFERROR(INDEX(BDProdutos!A:H,MATCH(Vendas!B21,BDProdutos!A:A,0),2),\"\")","v":""},null,null,null,null,null,{"$f":"IFERROR(INDEX(BDProdutos!A:H,MATCH(Vendas!B21,BDProdutos!A:A,0),3),\"\")","v":""},null,""]
[null,null,null,null,null,{"$f":"IFERROR(INDEX(BDProdutos!A:H,MATCH(Vendas!B22,BDProdutos!A:A,0),2),\"\")","v":""},null,null,null,null,null,{"$f":"IFERROR(INDEX(BDProdutos!A:H,MATCH(Vendas!B22,BDProdutos!A:A,0),3),\"\")","v":""},null,""]
[null,null,null,null,null,{"$f":"IFERROR(INDEX(BDProdutos!A:H,MATCH(Vendas!B23,BDProdutos!A:A,0),2),\"\")","v":""},null,null,null,null,null,{"$f":"IFERROR(INDEX(BDProdutos!A:H,MATCH(Vendas!B23,BDProdutos!A:A,0),3),\"\")","v":""},null,""]
[null,null,null,null,null,{"$f":"IFERROR(INDEX(BDProdutos!A:H,MATCH(Vendas!B24,BDProdutos!A:A,0),2),\"\")","v":""},null,null,null,null,null,{"$f":"IFERROR(INDEX(BDProdutos!A:H,MATCH(Vendas!B24,BDProdutos!A:A,0),3),\"\")","v":""},null,""]
[null,null,null,null,null,{"$f":"IFERROR(INDEX(BDProdutos!A:H,MATCH(Vendas!B25,BDProdutos!A:A,0),2),\"\")","v":""},null,null,null,null,null,{"$f":"IFERROR(INDEX(BDProdutos!A:H,MATCH(Vendas!B25,BDProdutos!A:A,0),3),\"\")","v":""},null,""]
[null,null,null,null,null,{"$f":"IFERROR(INDEX(BDProdutos!A:H,MATCH(Vendas!B26,BDProdutos!A:A,0),2),\"\")","v":""},null,null,null,null,null,{"$f":"IFERROR(INDEX(BDProdutos!A:H,MATCH(Vendas!B26,BDProdutos!A:A,0),3),\"\")","v":""},null,""]
[null,null,null,null,null,{"$f":"IFERROR(INDEX(BDProdutos!A:H,MATCH(Vendas!B27,BDProdutos!A:A,0),2),\"\")","v":""},null,null,null,null,null,{"$f":"IFERROR(INDEX(BDProdutos!A:H,MATCH(Vendas!B27,BDProdutos!A:A,0),3),\"\")","v":""},null,""]
[null,null,null,null,null,{"$f":"IFERROR(INDEX(BDProdutos!A:H,MATCH(Vendas!B28,BDProdutos!A:A,0),2),\"\")","v":""},null,null,null,null,null,{"$f":"IFERROR(INDEX(BDProdutos!A:H,MATCH(Vendas!B28,BDProdutos!A:A,0),3),\"\")","v":""},null,""]
[null,null,null,null,null,{"$f":"IFERROR(INDEX(BDProdutos!A:H,MATCH(Vendas!B29,BDProdutos!A:A,0),2),\"\")","v":""},null,null,null,null,null,{"$f":"IFERROR(INDEX(BDProdutos!A:H,MATCH(Vendas!B29,BDProdutos!A:A,0),3),\"\")","v":""},null,""]
[null,null,null,null,null,{"$f":"IFERROR(INDEX(BDProdutos!A:H,MATCH(Vendas!B30,BDProdutos!A:A,0),2),\"\")","v":""},null,null,null,null,null,{"$f":"IFERROR(INDEX(BDProdutos!A:H,MATCH(Vendas!B30,BDProdutos!A:A,0),3),\"\")","v":""},null,""]
{"$rows_left_out":39}
{"sheet":"Relatório","index":4,"n_rows":0,"n_cols":0,"rows_kept":0,"cut":false,"hidden":false,"merged":[]}

{"sheet":"Instruções","index":5,"n_rows":0,"n_cols":0,"rows_kept":0,"cut":false,"hidden":false,"merged":[]}

{"sheet":"BDClientes","index":6,"n_rows":1000,"n_cols":4,"rows_kept":1000,"cut":false,"hidden":false,"merged":[]}
["Código","Nome","Endereço","Telefone"]
[1,"Cliente A","Avenida Brasil",123456789]
[2]
[3]
[4]
[5]
[6]
[7]
[8]
[9]
[10]
[11]
[12]
[13]
[14]
[15]
[16]
[17]
[18]
[19]
[20]
[21]
[22]
[23]
[24]
[25]
[26]
[27]
[28]
[29]
{"$rows_left_out":971}
{"sheet":"BDProdutos","index":7,"n_rows":501,"n_cols":8,"rows_kept":501,"cut":false,"hidden":false,"merged":[]}
["Código","Descrição","Valor","Estoque Mínimo","Fornecedor","Saldo Estoque","Estoque Crítico","Saldo Estoque R$"]
[1,"Produto 1",50,30,"Fornecedor ABC",{"$f":"SUMIFS(BDMovEstoque!C:C,BDMovEstoque!A:A,Tabela3[[#This Row],[Código]],BDMovEstoque!G:G,\"Entrada\")-SUMIFS(BDMovEstoque!C:C,BDMovEstoque!A:A,Tabela3[[#This Row],[Código]],BDMovEstoque!G:G,\"Saída\")","v":80},{"$f":"IF(Tabela3[[#This Row],[Saldo Estoque]]<Tabela3[[#This Row],[Estoque Mínimo]],\"Sim\",\"\")","v":""},{"$f":"Tabela3[[#This Row],[Saldo Estoque]]*Tabela3[[#This Row],[Valor]]","v":4000}]
[2,"Produto 2",10,20,"Fornecedor ABC",{"$f":"SUMIFS(BDMovEstoque!C:C,BDMovEstoque!A:A,Tabela3[[#This Row],[Código]],BDMovEstoque!G:G,\"Entrada\")-SUMIFS(BDMovEstoque!C:C,BDMovEstoque!A:A,Tabela3[[#This Row],[Código]],BDMovEstoque!G:G,\"Saída\")","v":10},{"$f":"IF(Tabela3[[#This Row],[Saldo Estoque]]<Tabela3[[#This Row],[Estoque Mínimo]],\"Sim\",\"\")","v":"Sim"},{"$f":"Tabela3[[#This Row],[Saldo Estoque]]*Tabela3[[#This Row],[Valor]]","v":100}]
[3,"Produto 3",15,50,"Fornecedor ABC",{"$f":"SUMIFS(BDMovEstoque!C:C,BDMovEstoque!A:A,Tabela3[[#This Row],[Código]],BDMovEstoque!G:G,\"Entrada\")-SUMIFS(BDMovEstoque!C:C,BDMovEstoque!A:A,Tabela3[[#This Row],[Código]],BDMovEstoque!G:G,\"Saída\")","v":0},{"$f":"IF(Tabela3[[#This Row],[Saldo Estoque]]<Tabela3[[#This Row],[Estoque Mínimo]],\"Sim\",\"\")","v":"Sim"},{"$f":"Tabela3[[#This Row],[Saldo Estoque]]*Tabela3[[#This Row],[Valor]]","v":0}]
[4,"Produto 4",100,5,"Fornecedor ABC",{"$f":"SUMIFS(BDMovEstoque!C:C,BDMovEstoque!A:A,Tabela3[[#This Row],[Código]],BDMovEstoque!G:G,\"Entrada\")-SUMIFS(BDMovEstoque!C:C,BDMovEstoque!A:A,Tabela3[[#This Row],[Código]],BDMovEstoque!G:G,\"Saída\")","v":0},{"$f":"IF(Tabela3[[#This Row],[Saldo Estoque]]<Tabela3[[#This Row],[Estoque Mínimo]],\"Sim\",\"\")","v":"Sim"},{"$f":"Tabela3[[#This Row],[Saldo Estoque]]*Tabela3[[#This Row],[Valor]]","v":0}]
[5,"Produto 5",30,2,"Fornecedor ABC",{"$f":"SUMIFS(BDMovEstoque!C:C,BDMovEstoque!A:A,Tabela3[[#This Row],[Código]],BDMovEstoque!G:G,\"Entrada\")-SUMIFS(BDMovEstoque!C:C,BDMovEstoque!A:A,Tabela3[[#This Row],[Código]],BDMovEstoque!G:G,\"Saída\")","v":0},{"$f":"IF(Tabela3[[#This Row],[Saldo Estoque]]<Tabela3[[#This Row],[Estoque Mínimo]],\"Sim\",\"\")","v":"Sim"},{"$f":"Tabela3[[#This Row],[Saldo Estoque]]*Tabela3[[#This Row],[Valor]]","v":0}]
[6,"Produto 6",25,2,"Fornecedor ABC",{"$f":"SUMIFS(BDMovEstoque!C:C,BDMovEstoque!A:A,Tabela3[[#This Row],[Código]],BDMovEstoque!G:G,\"Entrada\")-SUMIFS(BDMovEstoque!C:C,BDMovEstoque!A:A,Tabela3[[#This Row],[Código]],BDMovEstoque!G:G,\"Saída\")","v":0},{"$f":"IF(Tabela3[[#This Row],[Saldo Estoque]]<Tabela3[[#This Row],[Estoque Mínimo]],\"Sim\",\"\")","v":"Sim"},{"$f":"Tabela3[[#This Row],[Saldo Estoque]]*Tabela3[[#This Row],[Valor]]","v":0}]
[7,null,null,null,null,{"$f":"SUMIFS(BDMovEstoque!C:C,BDMovEstoque!A:A,Tabela3[[#This Row],[Código]],BDMovEstoque!G:G,\"Entrada\")-SUMIFS(BDMovEstoque!C:C,BDMovEstoque!A:A,Tabela3[[#This Row],[Código]],BDMovEstoque!G:G,\"Saída\")","v":0},{"$f":"IF(Tabela3[[#This Row],[Saldo Estoque]]<Tabela3[[#This Row],[Estoque Mínimo]],\"Sim\",\"\")","v":""},{"$f":"Tabela3[[#This Row],[Saldo Estoque]]*Tabela3[[#This Row],[Valor]]","v":0}]
[8,null,null,null,null,{"$f":"SUMIFS(BDMovEstoque!C:C,BDMovEstoque!A:A,Tabela3[[#This Row],[Código]],BDMovEstoque!G:G,\"Entrada\")-SUMIFS(BDMovEstoque!C:C,BDMovEstoque!A:A,Tabela3[[#This Row],[Código]],BDMovEstoque!G:G,\"Saída\")","v":0},{"$f":"IF(Tabela3[[#This Row],[Saldo Estoque]]<Tabela3[[#This Row],[Estoque Mínimo]],\"Sim\",\"\")","v":""},{"$f":"Tabela3[[#This Row],[Saldo Estoque]]*Tabela3[[#This Row],[Valor]]","v":0}]
[9,null,null,null,null,{"$f":"SUMIFS(BDMovEstoque!C:C,BDMovEstoque!A:A,Tabela3[[#This Row],[Código]],BDMovEstoque!G:G,\"Entrada\")-SUMIFS(BDMovEstoque!C:C,BDMovEstoque!A:A,Tabela3[[#This Row],[Código]],BDMovEstoque!G:G,\"Saída\")","v":0},{"$f":"IF(Tabela3[[#This Row],[Saldo Estoque]]<Tabela3[[#This Row],[Estoque Mínimo]],\"Sim\",\"\")","v":""},{"$f":"Tabela3[[#This Row],[Saldo Estoque]]*Tabela3[[#This Row],[Valor]]","v":0}]
[10,null,null,null,null,{"$f":"SUMIFS(BDMovEstoque!C:C,BDMovEstoque!A:A,Tabela3[[#This Row],[Código]],BDMovEstoque!G:G,\"Entrada\")-SUMIFS(BDMovEstoque!C:C,BDMovEstoque!A:A,Tabela3[[#This Row],[Código]],BDMovEstoque!G:G,\"Saída\")","v":0},{"$f":"IF(Tabela3[[#This Row],[Saldo Estoque]]<Tabela3[[#This Row],[Estoque Mínimo]],\"Sim\",\"\")","v":""},{"$f":"Tabela3[[#This Row],[Saldo Estoque]]*Tabela3[[#This Row],[Valor]]","v":0}]
[11,null,null,null,null,{"$f":"SUMIFS(BDMovEstoque!C:C,BDMovEstoque!A:A,Tabela3[[#This Row],[Código]],BDMovEstoque!G:G,\"Entrada\")-SUMIFS(BDMovEstoque!C:C,BDMovEstoque!A:A,Tabela3[[#This Row],[Código]],BDMovEstoque!G:G,\"Saída\")","v":0},{"$f":"IF(Tabela3[[#This Row],[Saldo Estoque]]<Tabela3[[#This Row],[Estoque Mínimo]],\"Sim\",\"\")","v":""},{"$f":"Tabela3[[#This Row],[Saldo Estoque]]*Tabela3[[#This Row],[Valor]]","v":0}]
[12,null,null,null,null,{"$f":"SUMIFS(BDMovEstoque!C:C,BDMovEstoque!A:A,Tabela3[[#This Row],[Código]],BDMovEstoque!G:G,\"Entrada\")-SUMIFS(BDMovEstoque!C:C,BDMovEstoque!A:A,Tabela3[[#This Row],[Código]],BDMovEstoque!G:G,\"Saída\")","v":0},{"$f":"IF(Tabela3[[#This Row],[Saldo Estoque]]<Tabela3[[#This Row],[Estoque Mínimo]],\"Sim\",\"\")","v":""},{"$f":"Tabela3[[#This Row],[Saldo Estoque]]*Tabela3[[#This Row],[Valor]]","v":0}]
[13,null,null,null,null,{"$f":"SUMIFS(BDMovEstoque!C:C,BDMovEstoque!A:A,Tabela3[[#This Row],[Código]],BDMovEstoque!G:G,\"Entrada\")-SUMIFS(BDMovEstoque!C:C,BDMovEstoque!A:A,Tabela3[[#This Row],[Código]],BDMovEstoque!G:G,\"Saída\")","v":0},{"$f":"IF(Tabela3[[#This Row],[Saldo Estoque]]<Tabela3[[#This Row],[Estoque Mínimo]],\"Sim\",\"\")","v":""},{"$f":"Tabela3[[#This Row],[Saldo Estoque]]*Tabela3[[#This Row],[Valor]]","v":0}]
[14,null,null,null,null,{"$f":"SUMIFS(BDMovEstoque!C:C,BDMovEstoque!A:A,Tabela3[[#This Row],[Código]],BDMovEstoque!G:G,\"Entrada\")-SUMIFS(BDMovEstoque!C:C,BDMovEstoque!A:A,Tabela3[[#This Row],[Código]],BDMovEstoque!G:G,\"Saída\")","v":0},{"$f":"IF(Tabela3[[#This Row],[Saldo Estoque]]<Tabela3[[#This Row],[Estoque Mínimo]],\"Sim\",\"\")","v":""},{"$f":"Tabela3[[#This Row],[Saldo Estoque]]*Tabela3[[#This Row],[Valor]]","v":0}]
[15,null,null,null,null,{"$f":"SUMIFS(BDMovEstoque!C:C,BDMovEstoque!A:A,Tabela3[[#This Row],[Código]],BDMovEstoque!G:G,\"Entrada\")-SUMIFS(BDMovEstoque!C:C,BDMovEstoque!A:A,Tabela3[[#This Row],[Código]],BDMovEstoque!G:G,\"Saída\")","v":0},{"$f":"IF(Tabela3[[#This Row],[Saldo Estoque]]<Tabela3[[#This Row],[Estoque Mínimo]],\"Sim\",\"\")","v":""},{"$f":"Tabela3[[#This Row],[Saldo Estoque]]*Tabela3[[#This Row],[Valor]]","v":0}]
[16,null,null,null,null,{"$f":"SUMIFS(BDMovEstoque!C:C,BDMovEstoque!A:A,Tabela3[[#This Row],[Código]],BDMovEstoque!G:G,\"Entrada\")-SUMIFS(BDMovEstoque!C:C,BDMovEstoque!A:A,Tabela3[[#This Row],[Código]],BDMovEstoque!G:G,\"Saída\")","v":0},{"$f":"IF(Tabela3[[#This Row],[Saldo Estoque]]<Tabela3[[#This Row],[Estoque Mínimo]],\"Sim\",\"\")","v":""},{"$f":"Tabela3[[#This Row],[Saldo Estoque]]*Tabela3[[#This Row],[Valor]]","v":0}]
[17,null,null,null,null,{"$f":"SUMIFS(BDMovEstoque!C:C,BDMovEstoque!A:A,Tabela3[[#This Row],[Código]],BDMovEstoque!G:G,\"Entrada\")-SUMIFS(BDMovEstoque!C:C,BDMovEstoque!A:A,Tabela3[[#This Row],[Código]],BDMovEstoque!G:G,\"Saída\")","v":0},{"$f":"IF(Tabela3[[#This Row],[Saldo Estoque]]<Tabela3[[#This Row],[Estoque Mínimo]],\"Sim\",\"\")","v":""},{"$f":"Tabela3[[#This Row],[Saldo Estoque]]*Tabela3[[#This Row],[Valor]]","v":0}]
[18,null,null,null,null,{"$f":"SUMIFS(BDMovEstoque!C:C,BDMovEstoque!A:A,Tabela3[[#This Row],[Código]],BDMovEstoque!G:G,\"Entrada\")-SUMIFS(BDMovEstoque!C:C,BDMovEstoque!A:A,Tabela3[[#This Row],[Código]],BDMovEstoque!G:G,\"Saída\")","v":0},{"$f":"IF(Tabela3[[#This Row],[Saldo Estoque]]<Tabela3[[#This Row],[Estoque Mínimo]],\"Sim\",\"\")","v":""},{"$f":"Tabela3[[#This Row],[Saldo Estoque]]*Tabela3[[#This Row],[Valor]]","v":0}]
[19,null,null,null,null,{"$f":"SUMIFS(BDMovEstoque!C:C,BDMovEstoque!A:A,Tabela3[[#This Row],[Código]],BDMovEstoque!G:G,\"Entrada\")-SUMIFS(BDMovEstoque!C:C,BDMovEstoque!A:A,Tabela3[[#This Row],[Código]],BDMovEstoque!G:G,\"Saída\")","v":0},{"$f":"IF(Tabela3[[#This Row],[Saldo Estoque]]<Tabela3[[#This Row],[Estoque Mínimo]],\"Sim\",\"\")","v":""},{"$f":"Tabela3[[#This Row],[Saldo Estoque]]*Tabela3[[#This Row],[Valor]]","v":0}]
[20,null,null,null,null,{"$f":"SUMIFS(BDMovEstoque!C:C,BDMovEstoque!A:A,Tabela3[[#This Row],[Código]],BDMovEstoque!G:G,\"Entrada\")-SUMIFS(BDMovEstoque!C:C,BDMovEstoque!A:A,Tabela3[[#This Row],[Código]],BDMovEstoque!G:G,\"Saída\")","v":0},{"$f":"IF(Tabela3[[#This Row],[Saldo Estoque]]<Tabela3[[#This Row],[Estoque Mínimo]],\"Sim\",\"\")","v":""},{"$f":"Tabela3[[#This Row],[Saldo Estoque]]*Tabela3[[#This Row],[Valor]]","v":0}]
[21,null,null,null,null,{"$f":"SUMIFS(BDMovEstoque!C:C,BDMovEstoque!A:A,Tabela3[[#This Row],[Código]],BDMovEstoque!G:G,\"Entrada\")-SUMIFS(BDMovEstoque!C:C,BDMovEstoque!A:A,Tabela3[[#This Row],[Código]],BDMovEstoque!G:G,\"Saída\")","v":0},{"$f":"IF(Tabela3[[#This Row],[Saldo Estoque]]<Tabela3[[#This Row],[Estoque Mínimo]],\"Sim\",\"\")","v":""},{"$f":"Tabela3[[#This Row],[Saldo Estoque]]*Tabela3[[#This Row],[Valor]]","v":0}]
[22,null,null,null,null,{"$f":"SUMIFS(BDMovEstoque!C:C,BDMovEstoque!A:A,Tabela3[[#This Row],[Código]],BDMovEstoque!G:G,\"Entrada\")-SUMIFS(BDMovEstoque!C:C,BDMovEstoque!A:A,Tabela3[[#This Row],[Código]],BDMovEstoque!G:G,\"Saída\")","v":0},{"$f":"IF(Tabela3[[#This Row],[Saldo Estoque]]<Tabela3[[#This Row],[Estoque Mínimo]],\"Sim\",\"\")","v":""},{"$f":"Tabela3[[#This Row],[Saldo Estoque]]*Tabela3[[#This Row],[Valor]]","v":0}]
[23,null,null,null,null,{"$f":"SUMIFS(BDMovEstoque!C:C,BDMovEstoque!A:A,Tabela3[[#This Row],[Código]],BDMovEstoque!G:G,\"Entrada\")-SUMIFS(BDMovEstoque!C:C,BDMovEstoque!A:A,Tabela3[[#This Row],[Código]],BDMovEstoque!G:G,\"Saída\")","v":0},{"$f":"IF(Tabela3[[#This Row],[Saldo Estoque]]<Tabela3[[#This Row],[Estoque Mínimo]],\"Sim\",\"\")","v":""},{"$f":"Tabela3[[#This Row],[Saldo Estoque]]*Tabela3[[#This Row],[Valor]]","v":0}]
[24,null,null,null,null,{"$f":"SUMIFS(BDMovEstoque!C:C,BDMovEstoque!A:A,Tabela3[[#This Row],[Código]],BDMovEstoque!G:G,\"Entrada\")-SUMIFS(BDMovEstoque!C:C,BDMovEstoque!A:A,Tabela3[[#This Row],[Código]],BDMovEstoque!G:G,\"Saída\")","v":0},{"$f":"IF(Tabela3[[#This Row],[Saldo Estoque]]<Tabela3[[#This Row],[Estoque Mínimo]],\"Sim\",\"\")","v":""},{"$f":"Tabela3[[#This Row],[Saldo Estoque]]*Tabela3[[#This Row],[Valor]]","v":0}]
[25,null,null,null,null,{"$f":"SUMIFS(BDMovEstoque!C:C,BDMovEstoque!A:A,Tabela3[[#This Row],[Código]],BDMovEstoque!G:G,\"Entrada\")-SUMIFS(BDMovEstoque!C:C,BDMovEstoque!A:A,Tabela3[[#This Row],[Código]],BDMovEstoque!G:G,\"Saída\")","v":0},{"$f":"IF(Tabela3[[#This Row],[Saldo Estoque]]<Tabela3[[#This Row],[Estoque Mínimo]],\"Sim\",\"\")","v":""},{"$f":"Tabela3[[#This Row],[Saldo Estoque]]*Tabela3[[#This Row],[Valor]]","v":0}]
[26,null,null,null,null,{"$f":"SUMIFS(BDMovEstoque!C:C,BDMovEstoque!A:A,Tabela3[[#This Row],[Código]],BDMovEstoque!G:G,\"Entrada\")-SUMIFS(BDMovEstoque!C:C,BDMovEstoque!A:A,Tabela3[[#This Row],[Código]],BDMovEstoque!G:G,\"Saída\")","v":0},{"$f":"IF(Tabela3[[#This Row],[Saldo Estoque]]<Tabela3[[#This Row],[Estoque Mínimo]],\"Sim\",\"\")","v":""},{"$f":"Tabela3[[#This Row],[Saldo Estoque]]*Tabela3[[#This Row],[Valor]]","v":0}]
[27,null,null,null,null,{"$f":"SUMIFS(BDMovEstoque!C:C,BDMovEstoque!A:A,Tabela3[[#This Row],[Código]],BDMovEstoque!G:G,\"Entrada\")-SUMIFS(BDMovEstoque!C:C,BDMovEstoque!A:A,Tabela3[[#This Row],[Código]],BDMovEstoque!G:G,\"Saída\")","v":0},{"$f":"IF(Tabela3[[#This Row],[Saldo Estoque]]<Tabela3[[#This Row],[Estoque Mínimo]],\"Sim\",\"\")","v":""},{"$f":"Tabela3[[#This Row],[Saldo Estoque]]*Tabela3[[#This Row],[Valor]]","v":0}]
[28,null,null,null,null,{"$f":"SUMIFS(BDMovEstoque!C:C,BDMovEstoque!A:A,Tabela3[[#This Row],[Código]],BDMovEstoque!G:G,\"Entrada\")-SUMIFS(BDMovEstoque!C:C,BDMovEstoque!A:A,Tabela3[[#This Row],[Código]],BDMovEstoque!G:G,\"Saída\")","v":0},{"$f":"IF(Tabela3[[#This Row],[Saldo Estoque]]<Tabela3[[#This Row],[Estoque Mínimo]],\"Sim\",\"\")","v":""},{"$f":"Tabela3[[#This Row],[Saldo Estoque]]*Tabela3[[#This Row],[Valor]]","v":0}]
[29,null,null,null,null,{"$f":"SUMIFS(BDMovEstoque!C:C,BDMovEstoque!A:A,Tabela3[[#This Row],[Código]],BDMovEstoque!G:G,\"Entrada\")-SUMIFS(BDMovEstoque!C:C,BDMovEstoque!A:A,Tabela3[[#This Row],[Código]],BDMovEstoque!G:G,\"Saída\")","v":0},{"$f":"IF(Tabela3[[#This Row],[Saldo Estoque]]<Tabela3[[#This Row],[Estoque Mínimo]],\"Sim\",\"\")","v":""},{"$f":"Tabela3[[#This Row],[Saldo Estoque]]*Tabela3[[#This Row],[Valor]]","v":0}]
{"$rows_left_out":472}
{"sheet":"BDVendas","index":8,"n_rows":2,"n_cols":4,"rows_kept":2,"cut":false,"hidden":false,"merged":[]}
["Código Cliente","Cliente","Total","Data"]
[1,"Cliente A",50,"2021-11-08"]

{"sheet":"BDMovEstoque","index":9,"n_rows":5,"n_cols":7,"rows_kept":5,"cut":false,"hidden":false,"merged":[]}
["Código Produto","Descrição","Quantidade","Valor","Data Entrada","Data Saída","Tipo"]
[2,"Produto 2",15,10,"2021-11-08",null,"Entrada"]
[2,"Produto 2",5,10,null,"2021-11-08","Saída"]
[1,"Produto 1",100,50,"2021-11-08",null,"Entrada"]
[1,"Produto 1",20,50,null,"2021-11-08","Saída"]

{"sheet":"Tab","index":10,"n_rows":9,"n_cols":26,"rows_kept":9,"cut":false,"hidden":false,"merged":[]}
["Estoque Crítico","Sim",null,null,"Rótulos de Linha","Soma de Saldo Estoque",null,"Rótulos de Linha","Soma de Saldo Estoque R$",null,null,null,null,null,null,null,null,null,null,null,"Tipo","Saída",null,null,"Tipo","Entrada"]
[null,null,null,null,"Produto 1",80,null,"Produto 1",4000,null,null,"Tipo","Entrada"]
["Rótulos de Linha","Soma de Saldo Estoque",null,null,"Produto 2",10,null,"Produto 2",100,null,null,null,null,null,null,null,null,null,null,null,"Rótulos de Linha","Soma de Quantidade",null,null,"Rótulos de Linha","Soma de Quantidade"]
["Produto 2",10,null,null,"Produto 5",0,null,"Produto 5",0,null,null,"Rótulos de Linha","Descrição","Soma de Quantidade",null,"Compra Recente","Descrição","Qtde.",null,null,"Produto 1",20,null,null,"Produto 1",100]
["Produto 3",0,null,null,"Produto 4",0,null,"Produto 4",0,null,null,"08/nov","Produto 2",15,null,{"$f":"L5","v":"08/nov"},{"$f":"M5","v":"Produto 2"},{"$f":"N5","v":15},null,null,"Produto 2",5,null,null,"Produto 2",15]
["Produto 4",0,null,null,"Produto 6",0,null,"Produto 6",0,null,null,"08/nov","Produto 1",100,null,{"$f":"L6","v":"08/nov"},{"$f":"M6","v":"Produto 1"},{"$f":"N6","v":100},null,null,"Total Geral",25,null,null,"Total Geral",115]
["Produto 5",0,null,null,"(vazio)",0,null,"(vazio)",0,null,null,null,null,null,null,0,0,0]
["Produto 6",0,null,null,"Produto 3",0,null,"Produto 3",0,null,null,null,null,null,null,0,0,0]
["Total Geral",10,null,null,"Total Geral",90,null,"Total Geral",4100,null,null,null,null,null,null,0,0,0]